{"text_format":"1","workbook":"xlsx","n_sheets":6,"sheets":["Basic_Data","Contacts","Risk_Analysis","Measurements","Help","Settings"],"not_rendered":{"charts":2,"images":1,"macros":1,"external_links":0,"defined_names":1,"comments":0,"pivot_tables":0},"unopened":[],"bounds":{"document_bytes":16777216,"sheet_cells":100000,"rows_first":2000,"rows_last":500,"rows_between":2000,"halvings":0,"cell_chars":16384,"cell_head_chars":4096},"cells_cut":0,"cells_raw":0,"read":"whole","date_system":"1900"}

{"sheet":"Basic_Data","index":0,"n_rows":19,"n_cols":10,"rows_kept":19,"cut":false,"hidden":false,"merged":[]}
[]
[null,null,null,"Quarantine Calculator"]
[null,null,null,"SARS-CoV-2",null,null,null,null,null,"Note and disclaimer"]
[null,null,null,"Advanced risk management",null,null,"Author:"]
[null,null,null,null,null,null,"Dr.med. Andreas Paaßen",null,null,"These recommendations are based on probability"]
[null,null,null,"Version 2.3",null,null,"Chemical Park Marl",null,null,"calculations and represent an optimum between effort"]
[null,null,null,null,null,null,null,null,null,"and risk.  "]
[]
{"$rows_left_out":12}
{"sheet":"Contacts","index":1,"n_rows":34,"n_cols":44,"rows_kept":34,"cut":false,"hidden":false,"merged":[]}
[null,null,null,null,"Relation","Names",-3,-2,-1,0,1,2,3,4,5,6,7,8,9,null,{"$f":"IF($C$3=$J$2,SUM($K$3:$S$3),IF($C$3=$K$2,SUM($L$3:$S$3),IF($C$3=$L$2,SUM($M$3:$S$3),IF($C$3=$M$2,SUM($N$3:$S$3),IF($C$3=$N$2,SUM($O$3:$S$3),IF($C$3=$O$2,SUM($P$3:$S$3),SUM($Q$3:$S$3)))))))","v":2.5000000000000001E-3},"Eff Isolation",null,null,null,null,null,null,null,"H","M","G","U",null,null,null,null,null,null,"Transmissions-",null,null,null,"Cumulative"]
[null,null,{"$f":"IF($C$6>DATEVALUE(\"01.01.1900\"),$C$6,IF(AND($C$12>DATEVALUE(\"01.01.1900\"),OR($C$4=\"Nein\",$C$4=\"Unbekannt\")),$C$12+5,IF($C$8>DATEVALUE(\"01.01.1900\"),$C$8,IF($C$10>DATEVALUE(\"01.01.1900\"),$C$10-1,IF($C$12>DATEVALUE(\"01.01.1900\"),$C$12+5,$C$13)))))","v":"1900-01-01"},null,null,"Step A: source case",{"$f":"IF($C$6>DATEVALUE(\"01.01.1900\"),$C$6-3,IF(AND($C$12>DATEVALUE(\"01.01.1900\"),OR($C$4=\"Nein\",$C$4=\"Unbekannt\")),$C$12+2,IF($C$8>DATEVALUE(\"01.01.1900\"),$C$8-3,IF($C$10>DATEVALUE(\"01.01.1900\"),$C$10-4,IF($C$12>DATEVALUE(\"01.01.1900\"),$C$12+2,$C$13)))))","v":"1900-01-01"},{"$f":"$G$2+1","v":"1900-01-02"},{"$f":"$G$2+2","v":"1900-01-03"},{"$f":"$G$2+3","v":"1900-01-04"},{"$f":"$G$2+4","v":"1900-01-05"},{"$f":"$G$2+5","v":"1900-01-06"},{"$f":"$G$2+6","v":"1900-01-07"},{"$f":"$G$2+7","v":"1900-01-08"},{"$f":"$G$2+8","v":"1900-01-09"},{"$f":"$G$2+9","v":"1900-01-10"},{"$f":"$G$2+10","v":"1900-01-11"},{"$f":"$G$2+11","v":"1900-01-12"},{"$f":"$G$2+12","v":"1900-01-13"},null,{"$f":"IF($C$3=$J$2,SUM($H$3:$S$3),IF($C$3=$K$2,SUM($I$3:$S$3),IF($C$3=$L$2,SUM($J$3:$S$3),IF($C$3=$M$2,SUM($L$3:$S$3),IF($C$3=$N$2,SUM($M$3:$S$3),IF($C$3=$O$2,SUM($N$3:$S$3),SUM($O$3:$S$3)))))))","v":1.4578579999999999E-2},"Eff Quarantäne",null,null,null,null,null,null,null,{"$f":"Settings!G9","v":0.2},{"$f":"Settings!G11","v":0.1},{"$f":"Settings!G13","v":0.05},{"$f":"Settings!G15","v":0.01},null,null,null,null,null,null,"bedingungen",null,null,null,"risk of"]
[null,null,{"$f":"Basic_Data!F10","v":"00:00:00"},null,null,"Step B: direct contacts",7.1433650000000001E-2,0.13197249999999999,0.180176,0.19462299999999999,0.16947699999999999,0.118995,6.6822649999999997E-2,2.964495E-2,1.0239689999999999E-2,1.8388899999999999E-3,2.5000000000000001E-3,0,0,null,{"$f":"IF($C$3=$J$2,1,IF($C$3=$K$2,SUM($G$3:$S$3),IF($C$3=$L$2,SUM($H$3:$S$3),IF($C$3=$M$2,SUM($I$3:$S$3),IF($C$3=$N$2,SUM($J$3:$S$3),IF($C$3=$O$2,SUM($K$3:$S$3),SUM($L$3:$S$3)))))))","v":0.23004118000000001},"Eff Erweitert",null,null,null,null,null,null,null,"G","H","I","J","K","L","M","N","O","P",null,null,null,null,"Infection"]
[null,null,{"$f":"IF(Basic_Data!C10=\"Yes\",\"Ja\",IF(Basic_Data!C10=\"No\",\"Nein\",IF(Basic_Data!C10=\"Unknown\",\"Unbekannt\",Basic_Data!C10)))","v":0},null,"Nr. 1:",null,null,null,null,null,null,null,null,null,null,null,null,null,null,null,{"$f":"IF(OR($G$4=\"H\",$H$4=\"H\",$I$4=\"H\",$J$4=\"H\",$K$4=\"H\",$L$4=\"H\",$M$4=\"H\",$N$4=\"H\",$O$4=\"H\",$P$4=\"H\",$Q$4=\"H\",$R$4=\"H\",$S$4=\"H\"),\"H\",IF(OR($G$4=\"M\",$H$4=\"M\",$I$4=\"M\",$J$4=\"M\",$K$4=\"M\",$L$4=\"M\",$M$4=\"M\",$N$4=\"M\",$O$4=\"M\",$P$4=\"M\",$Q$4=\"M\",$R$4=\"M\",$S$4=\"M\"),\"M\",IF(OR($G$4=\"G\",$H$4=\"G\",$I$4=\"G\",$J$4=\"G\",$K$4=\"G\",$L$4=\"G\",$M$4=\"G\",$N$4=\"G\",$O$4=\"G\",$P$4=\"G\",$Q$4=\"G\",$R$4=\"G\",$S$4=\"G\",$G$4=\"L\",$H$4=\"L\",$I$4=\"L\",$J$4=\"L\",$K$4=\"L\",$L$4=\"L\",$M$4=\"L\",$N$4=\"L\",$O$4=\"L\",$P$4=\"L\",$Q$4=\"L\",$R$4=\"L\",$S$4=\"L\"),\"G\",\"\")))","v":""},{"$f":"IF($G$5=\"i\",$G$2,IF($H$5=\"i\",$H$2,IF($I$5=\"i\",$I$2,IF($J$5=\"i\",$J$2,IF($K$5=\"i\",$K$2,IF($L$5=\"i\",$L$2,IF($M$5=\"i\",$M$2,IF($N$5=\"i\",$N$2,IF($O$5=\"i\",$O$2,IF($P$5=\"i\",$P$2,IF($Q$5=\"i\",$Q$2,DATEVALUE(\"01.01.1900\"))))))))))))","v":"1900-01-01"},{"$f":"IF(NOT(ISBLANK($Q$4)),$Q$2,IF(NOT(ISBLANK($P$4)),$P$2,IF(NOT(ISBLANK($O$4)),$O$2,IF(NOT(ISBLANK($N$4)),$N$2,IF(NOT(ISBLANK($M$4)),$M$2,IF(NOT(ISBLANK($L$4)),$L$2,IF(NOT(ISBLANK($K$4)),$K$2,IF(NOT(ISBLANK($J$4)),$J$2,IF(NOT(ISBLANK($I$4)),$I$2,IF(NOT(ISBLANK($H$4)),$H$2,IF(NOT(ISBLANK($G$4)),$G$2,DATEVALUE(\"01.01.1900\"))))))))))))+14","v":"1900-01-15"},{"$f":"IF(G4=\"G\",$G$2,IF(H4=\"G\",$H$2,IF(I4=\"G\",$I$2,IF(J4=\"G\",$J$2,IF(K4=\"G\",$K$2,IF(L4=\"G\",$L$2,IF(M4=\"G\",$M$2,IF(N4=\"G\",$N$2,IF(O4=\"G\",$O$2,IF(P4=\"G\",$P$2,IF(Q4=\"G\",$Q$2,IF(R4=\"G\",$R$2,IF(S4=\"G\",$S$2,DATEVALUE(\"01.01.1900\"))))))))))))))+3","v":"1900-01-04"},null,null,null,null,null,{"$f":"IF(G4=\"H\",$G$3*$AD$2,IF(G4=\"M\",$G$3*$AE$2,IF(OR(G4=\"G\",G4=\"L\"),$G$3*$AF$2,0)))","v":0},{"$f":"IF(H4=\"H\",$H$3*$AD$2,IF(H4=\"M\",$H$3*$AE$2,IF(OR(H4=\"G\",H4=\"L\"),$H$3*$AF$2,0)))","v":0},{"$f":"IF(I4=\"H\",$I$3*$AD$2,IF(I4=\"M\",$I$3*$AE$2,IF(OR(I4=\"G\",I4=\"L\"),$I$3*$AF$2,0)))","v":0},{"$f":"IF(J4=\"H\",$J$3*$AD$2,IF(J4=\"M\",$J$3*$AE$2,IF(OR(J4=\"G\",J4=\"L\"),$J$3*$AF$2,0)))","v":0},{"$f":"IF(K4=\"H\",$K$3*$AD$2,IF(K4=\"M\",$K$3*$AE$2,IF(OR(K4=\"G\",K4=\"L\"),$K$3*$AF$2,0)))","v":0},{"$f":"IF(L4=\"H\",$L$3*$AD$2,IF(L4=\"M\",$L$3*$AE$2,IF(OR(L4=\"G\",L4=\"L\"),$L$3*$AF$2,0)))","v":0},{"$f":"IF(M4=\"H\",$M$3*$AD$2,IF(M4=\"M\",$M$3*$AE$2,IF(OR(M4=\"G\",M4=\"L\"),$M$3*$AF$2,0)))","v":0},{"$f":"IF(N4=\"H\",$N$3*$AD$2,IF(N4=\"M\",$N$3*$AE$2,IF(OR(N4=\"G\",N4=\"L\"),$N$3*$AF$2,0)))","v":0},{"$f":"IF(O4=\"H\",$O$3*$AD$2,IF(O4=\"M\",$O$3*$AE$2,IF(OR(O4=\"G\",O4=\"L\"),$O$3*$AF$2,0)))","v":0},{"$f":"IF(P4=\"H\",$P$3*$AD$2,IF(P4=\"M\",$P$3*$AE$2,IF(OR(P4=\"G\",P4=\"L\"),$P$3*$AE$2,0)))","v":0},{"$f":"SUM(AD4:AM4)","v":0},{"$f":"AN4*Risk_Analysis!$T$1","v":0},null,null,{"$f":"AO4","v":0}]
[null,null,null,null,null,null,{"$f":"\" \"","v":" "},{"$f":"\" \"","v":" "},{"$f":"IF(OR($H$5=\"i\",NOT(ISBLANK($G$4))),\"i\",\" \")","v":" "},{"$f":"IF(OR($I$5=\"i\",NOT(ISBLANK($H$4))),\"i\",\" \")","v":" "},{"$f":"IF(OR($J$5=\"i\",NOT(ISBLANK($I$4))),\"i\",\" \")","v":" "},{"$f":"IF(OR($K$5=\"i\",NOT(ISBLANK($J$4))),\"i\",\" \")","v":" "},{"$f":"IF(OR($L$5=\"i\",NOT(ISBLANK($K$4))),\"i\",\" \")","v":" "},{"$f":"IF(OR($M$5=\"i\",NOT(ISBLANK($L$4))),\"i\",\" \")","v":" "},{"$f":"IF(OR($N$5=\"i\",NOT(ISBLANK($M$4))),\"i\",\" \")","v":" "},{"$f":"IF(OR($O$5=\"i\",NOT(ISBLANK($N$4))),\"i\",\" \")","v":" "},{"$f":"IF(OR($P$5=\"i\",NOT(ISBLANK($O$4))),\"i\",\" \")","v":" "},{"$f":"IF(OR($Q$5=\"i\",NOT(ISBLANK($P$4))),\"i\",\" \")","v":" "},{"$f":"IF(OR($R$5=\"i\",NOT(ISBLANK($Q$4))),\"i\",\" \")","v":" "}]
[null,null,{"$f":"IF(ISBLANK(Basic_Data!C12),DATEVALUE(\"01.01.1900\"),Basic_Data!C12)","v":"1900-01-01"},null,"Nr. 2:",null,null,null,null,null,null,null,null,null,null,null,null,null,null,null,{"$f":"IF(OR($G$6=\"H\",$H$6=\"H\",$I$6=\"H\",$J$6=\"H\",$K$6=\"H\",$L$6=\"H\",$M$6=\"H\",$N$6=\"H\",$O$6=\"H\",$P$6=\"H\",$Q$6=\"H\",$R$6=\"H\",$S$6=\"H\"),\"H\",IF(OR($G$6=\"M\",$H$6=\"M\",$I$6=\"M\",$J$6=\"M\",$K$6=\"M\",$L$6=\"M\",$M$6=\"M\",$N$6=\"M\",$O$6=\"M\",$P$6=\"M\",$Q$6=\"M\",$R$6=\"M\",$S$6=\"M\"),\"M\",IF(OR($G$6=\"G\",$H$6=\"G\",$I$6=\"G\",$J$6=\"G\",$K$4=\"G\",$L$4=\"G\",$M$4=\"G\",$N$4=\"G\",$O$4=\"G\",$P$4=\"G\",$Q$4=\"G\",$R$4=\"G\",$S$4=\"G\",$G$4=\"L\",$H$4=\"L\",$I$4=\"L\",$J$4=\"L\",$K$4=\"L\",$L$4=\"L\",$M$4=\"L\",$N$4=\"L\",$O$4=\"L\",$P$4=\"L\",$Q$6=\"L\",$R$6=\"L\",$S$6=\"L\"),\"G\",\"\")))","v":""},{"$f":"IF($G$7=\"i\",$G$2,IF($H$7=\"i\",$H$2,IF($I$7=\"i\",$I$2,IF($J$7=\"i\",$J$2,IF($K$7=\"i\",$K$2,IF($L$7=\"i\",$L$2,IF($M$7=\"i\",$M$2,IF($N$7=\"i\",$N$2,IF($O$7=\"i\",$O$2,IF($P$7=\"i\",$P$2,IF($Q$7=\"i\",$Q$2,DATEVALUE(\"01.01.1900\"))))))))))))","v":"1900-01-01"},{"$f":"IF(NOT(ISBLANK($Q$6)),$Q$2,IF(NOT(ISBLANK($P$6)),$P$2,IF(NOT(ISBLANK($O$6)),$O$2,IF(NOT(ISBLANK($N$6)),$N$2,IF(NOT(ISBLANK($M$6)),$M$2,IF(NOT(ISBLANK($L$6)),$L$2,IF(NOT(ISBLANK($K$6)),$K$2,IF(NOT(ISBLANK($J$6)),$J$2,IF(NOT(ISBLANK($I$6)),$I$2,IF(NOT(ISBLANK($H$6)),$H$2,IF(NOT(ISBLANK($G$6)),$G$2,DATEVALUE(\"01.01.1900\"))))))))))))+14","v":"1900-01-15"},{"$f":"IF(G6=\"G\",$G$2,IF(H6=\"G\",$H$2,IF(I6=\"G\",$I$2,IF(J6=\"G\",$J$2,IF(K6=\"G\",$K$2,IF(L6=\"G\",$L$2,IF(M6=\"G\",$M$2,IF(N6=\"G\",$N$2,IF(O6=\"G\",$O$2,IF(P6=\"G\",$P$2,IF(Q6=\"G\",$Q$2,IF(R6=\"G\",$R$2,IF(S6=\"G\",$S$2,DATEVALUE(\"01.01.1900\"))))))))))))))+3","v":"1900-01-04"},null,null,null,null,null,{"$f":"IF(G6=\"H\",$G$3*$AD$2,IF(G6=\"M\",$G$3*$AE$2,IF(OR(G6=\"G\",G6=\"L\"),$G$3*$AF$2,0)))","v":0},{"$f":"IF(H6=\"H\",$H$3*$AD$2,IF(H6=\"M\",$H$3*$AE$2,IF(OR(H6=\"G\",H6=\"L\"),$H$3*$AF$2,0)))","v":0},{"$f":"IF(I6=\"H\",$I$3*$AD$2,IF(I6=\"M\",$I$3*$AE$2,IF(OR(I6=\"G\",I6=\"L\"),$I$3*$AF$2,0)))","v":0},{"$f":"IF(J6=\"H\",$J$3*$AD$2,IF(J6=\"M\",$J$3*$AE$2,IF(OR(J6=\"G\",J6=\"L\"),$J$3*$AF$2,0)))","v":0},{"$f":"IF(K6=\"H\",$K$3*$AD$2,IF(K6=\"M\",$K$3*$AE$2,IF(OR(K6=\"G\",K6=\"L\"),$K$3*$AF$2,0)))","v":0},{"$f":"IF(L6=\"H\",$L$3*$AD$2,IF(L6=\"M\",$L$3*$AE$2,IF(OR(L6=\"G\",L6=\"L\"),$L$3*$AF$2,0)))","v":0},{"$f":"IF(M6=\"H\",$M$3*$AD$2,IF(M6=\"M\",$M$3*$AE$2,IF(OR(M6=\"G\",M6=\"L\"),$M$3*$AF$2,0)))","v":0},{"$f":"IF(N6=\"H\",$N$3*$AD$2,IF(N6=\"M\",$N$3*$AE$2,IF(OR(N6=\"G\",N6=\"L\"),$N$3*$AF$2,0)))","v":0},{"$f":"IF(O6=\"H\",$O$3*$AD$2,IF(O6=\"M\",$O$3*$AE$2,IF(OR(O6=\"G\",O6=\"L\"),$O$3*$AF$2,0)))","v":0},{"$f":"IF(P6=\"H\",$P$3*$AD$2,IF(P6=\"M\",$P$3*$AE$2,IF(OR(P6=\"G\",P6=\"L\"),$P$3*$AE$2,0)))","v":0},{"$f":"SUM(AD6:AM6)","v":0},{"$f":"AN6*Risk_Analysis!$T$1","v":0},null,null,{"$f":"AO6","v":0}]
[null,null,null,null,null,null,{"$f":"\" \"","v":" "},{"$f":"\" \"","v":" "},{"$f":"IF(OR($H$7=\"i\",NOT(ISBLANK($G$6))),\"i\",\" \")","v":" "},{"$f":"IF(OR($I$7=\"i\",NOT(ISBLANK($H$6))),\"i\",\" \")","v":" "},{"$f":"IF(OR($J$7=\"i\",NOT(ISBLANK($I$6))),\"i\",\" \")","v":" "},{"$f":"IF(OR($K$7=\"i\",NOT(ISBLANK($J$6))),\"i\",\" \")","v":" "},{"$f":"IF(OR($L$7=\"i\",NOT(ISBLANK($K$6))),\"i\",\" \")","v":" "},{"$f":"IF(OR($M$7=\"i\",NOT(ISBLANK($L$6))),\"i\",\" \")","v":" "},{"$f":"IF(OR($N$7=\"i\",NOT(ISBLANK($M$6))),\"i\",\" \")","v":" "},{"$f":"IF(OR($O$7=\"i\",NOT(ISBLANK($N$6))),\"i\",\" \")","v":" "},{"$f":"IF(OR($P$7=\"i\",NOT(ISBLANK($O$6))),\"i\",\" \")","v":" "},{"$f":"IF(OR($Q$7=\"i\",NOT(ISBLANK($P$6))),\"i\",\" \")","v":" "},{"$f":"IF(OR($R$7=\"i\",NOT(ISBLANK($Q$6))),\"i\",\" \")","v":" "}]
[null,null,{"$f":"IF(ISBLANK(Basic_Data!C14),DATEVALUE(\"01.01.1900\"),Basic_Data!C14)","v":"1900-01-01"},null,"Nr. 3:",null,null,null,null,null,null,null,null,null,null,null,null,null,null,null,{"$f":"IF(OR($G$8=\"H\",$H$8=\"H\",$I$8=\"H\",$J$8=\"H\",$K$8=\"H\",$L$8=\"H\",$M$8=\"H\",$N$8=\"H\",$O$8=\"H\",$P$8=\"H\",$Q$8=\"H\",$R$8=\"H\",$S$8=\"H\"),\"H\",IF(OR($G$8=\"M\",$H$8=\"M\",$I$8=\"M\",$J$8=\"M\",$K$8=\"M\",$L$8=\"M\",$M$8=\"M\",$N$8=\"M\",$O$8=\"M\",$P$8=\"M\",$Q$8=\"M\",$R$8=\"M\",$S$8=\"M\"),\"M\",IF(OR($G$8=\"G\",$H$8=\"G\",$I$8=\"G\",$J$8=\"G\",$K$4=\"G\",$L$4=\"G\",$M$4=\"G\",$N$4=\"G\",$O$4=\"G\",$P$4=\"G\",$Q$4=\"G\",$R$4=\"G\",$S$4=\"G\",$G$4=\"L\",$H$4=\"L\",$I$4=\"L\",$J$4=\"L\",$K$4=\"L\",$L$4=\"L\",$M$4=\"L\",$N$4=\"L\",$O$4=\"L\",$P$4=\"L\",$Q$8=\"L\",$R$8=\"L\",$S$8=\"L\"),\"G\",\"\")))","v":""},{"$f":"IF($G$9=\"i\",$G$2,IF($H$9=\"i\",$H$2,IF($I$9=\"i\",$I$2,IF($J$9=\"i\",$J$2,IF($K$9=\"i\",$K$2,IF($L$9=\"i\",$L$2,IF($M$9=\"i\",$M$2,IF($N$9=\"i\",$N$2,IF($O$9=\"i\",$O$2,IF($P$9=\"i\",$P$2,IF($Q$9=\"i\",$Q$2,DATEVALUE(\"01.01.1900\"))))))))))))","v":"1900-01-01"},{"$f":"IF(NOT(ISBLANK($Q$8)),$Q$2,IF(NOT(ISBLANK($P$8)),$P$2,IF(NOT(ISBLANK($O$8)),$O$2,IF(NOT(ISBLANK($N$8)),$N$2,IF(NOT(ISBLANK($M$8)),$M$2,IF(NOT(ISBLANK($L$8)),$L$2,IF(NOT(ISBLANK($K$8)),$K$2,IF(NOT(ISBLANK($J$8)),$J$2,IF(NOT(ISBLANK($I$8)),$I$2,IF(NOT(ISBLANK($H$8)),$H$2,IF(NOT(ISBLANK($G$8)),$G$2,DATEVALUE(\"01.01.1900\"))))))))))))+14","v":"1900-01-15"},{"$f":"IF(G8=\"G\",$G$2,IF(H8=\"G\",$H$2,IF(I8=\"G\",$I$2,IF(J8=\"G\",$J$2,IF(K8=\"G\",$K$2,IF(L8=\"G\",$L$2,IF(M8=\"G\",$M$2,IF(N8=\"G\",$N$2,IF(O8=\"G\",$O$2,IF(P8=\"G\",$P$2,IF(Q8=\"G\",$Q$2,IF(R8=\"G\",$R$2,IF(S8=\"G\",$S$2,DATEVALUE(\"01.01.1900\"))))))))))))))+3","v":"1900-01-04"},null,null,null,null,null,{"$f":"IF(G8=\"H\",$G$3*$AD$2,IF(G8=\"M\",$G$3*$AE$2,IF(OR(G8=\"G\",G8=\"L\"),$G$3*$AF$2,0)))","v":0},{"$f":"IF(H8=\"H\",$H$3*$AD$2,IF(H8=\"M\",$H$3*$AE$2,IF(OR(H8=\"G\",H8=\"L\"),$H$3*$AF$2,0)))","v":0},{"$f":"IF(I8=\"H\",$I$3*$AD$2,IF(I8=\"M\",$I$3*$AE$2,IF(OR(I8=\"G\",I8=\"L\"),$I$3*$AF$2,0)))","v":0},{"$f":"IF(J8=\"H\",$J$3*$AD$2,IF(J8=\"M\",$J$3*$AE$2,IF(OR(J8=\"G\",J8=\"L\"),$J$3*$AF$2,0)))","v":0},{"$f":"IF(K8=\"H\",$K$3*$AD$2,IF(K8=\"M\",$K$3*$AE$2,IF(OR(K8=\"G\",K8=\"L\"),$K$3*$AF$2,0)))","v":0},{"$f":"IF(L8=\"H\",$L$3*$AD$2,IF(L8=\"M\",$L$3*$AE$2,IF(OR(L8=\"G\",L8=\"L\"),$L$3*$AF$2,0)))","v":0},{"$f":"IF(M8=\"H\",$M$3*$AD$2,IF(M8=\"M\",$M$3*$AE$2,IF(OR(M8=\"G\",M8=\"L\"),$M$3*$AF$2,0)))","v":0},{"$f":"IF(N8=\"H\",$N$3*$AD$2,IF(N8=\"M\",$N$3*$AE$2,IF(OR(N8=\"G\",N8=\"L\"),$N$3*$AF$2,0)))","v":0},{"$f":"IF(O8=\"H\",$O$3*$AD$2,IF(O8=\"M\",$O$3*$AE$2,IF(OR(O8=\"G\",O8=\"L\"),$O$3*$AF$2,0)))","v":0},{"$f":"IF(P8=\"H\",$P$3*$AD$2,IF(P8=\"M\",$P$3*$AE$2,IF(OR(P8=\"G\",P8=\"L\"),$P$3*$AE$2,0)))","v":0},{"$f":"SUM(AD8:AM8)","v":0},{"$f":"AN8*Risk_Analysis!$T$1","v":0},null,null,{"$f":"AO8","v":0}]
{"$rows_left_out":27}
{"sheet":"Risk_Analysis","index":2,"n_rows":22,"n_cols":27,"rows_kept":22,"cut":false,"hidden":false,"merged":[]}
[null,"Risk Analysis - Dashboard",null,null,null,null,null,null,null,null,null,null,null,null,null,null,null,null,"Basis-R",{"$f":"Settings!G7*$K$3/100","v":3.75},{"$f":"Contacts!$U$1*100","v":0.25},"Step A: Isolation source case",null,null,"Wild Type ",100," "]
[null,"Number of additional persons in the immediate labour/social sector:",null,null,null,null,0,null,"Virus Variant: ",null,"B 1.1.7 (England)",null,null,null,null,null,null,null,null,null,{"$f":"Contacts!$U$2*100","v":1.4578579999999999},"Step B: Quarantine direct Contacts",null,null,"B 1.1.7 (England)",150," "]
[null,"Security of complete contact determination:",null,null,null,null,"high",null,"Specific infectivity:",null,{"$f":"INDEX($Y$1:$Z$5,MATCH(K2,$Y$1:$Y$5,0),2)","v":150},"%",{"$f":"INDEX($Y$1:$AA$5,MATCH(K2,$Y$1:$Y$5,0),3)","v":" "},null,null,"What does that mean?",null,null,null,null,{"$f":"Contacts!$U$3*100","v":23.004118000000002},"Step C: Quarantine indirect Contacts",null,null,"B 1.351 (South Africa)",150,"nicht gesichert"]
[null,null,null,null,null,null,null,null,null,null,null,null,null,null,null,null,null,null,null,null,{"$f":"SUM(U1:U3)/3","v":8.2373253333333327},"Total Effectivity",null,null,"B 1.1.28 (Brasilia)",150,"nicht gesichert"]
[null,null,null,null,null,null,null,null,null,null,null,null,null,null,null,{"$f":"IF(U4<70,\"The effectiveness of the measures is\",\"The effectiveness of measures by\")","v":"The effectiveness of the measures is"},null,null,null,null,null,"Sicherheit Effektivitätsberechnung",null,null,"B 1.427 (California)",135,"nicht gesichert"]
[null,null,null,null,null,null,null,null,null,null,null,null,null,null,null,{"$f":"IF(U4<70,\"not optimal, as they were\",\"shortening the infectious time is good. \")","v":"not optimal, as they were"},null,null,null,null,null,"Sicherheit R-Berechnung",null,null,"B 1.526 (New York)",135,"nicht gesichert"]
[null,null,null,null,null,null,null,null,null,null,null,null,null,null,null,{"$f":"IF(U4<70,\"introduced (too) late.\",\"They were initiated at an early stage.\")","v":"introduced (too) late."},null,null,null,null,null,null,null,null,"Andere",100,"nicht gesichert"]
[null,null,null,null,null,null,null,null,null,null,null,null,null,null,null,null,null,null,null,null,{"$f":"Contacts!$AN$20","v":0},"Übertragenes Risiko Stufe B"]
{"$rows_left_out":15}
{"sheet":"Measurements","index":3,"n_rows":25,"n_cols":16,"rows_kept":25,"cut":false,"hidden":false,"merged":[[0,1,0,2],[0,3,0,4],[0,10,0,11],[0,6,0,7]]}
["Names","Possible Infectivity",null,"Isolation",null,"Info","Self or Contact Quarantine",null,"Info contact "," Initiation of Testing","Measurements Low Risk",null,null,null,"Infektiosität"]
[null,"from","to","from","to","Isolation","from","to","Quarantine","from","from","to",null,null,"Kontaktpers. ab"]
[null,{"$f":"Contacts!G2","v":"1900-01-01"},{"$f":"Contacts!S2+4","v":"1900-01-17"},{"$f":"IF(AND($N$3>B3,B3>DATEVALUE(\"01.01.2000\")),$N$3,B3)","v":"1900-01-01"},{"$f":"Contacts!S2+4","v":"1900-01-17"},"Yes",null,null,null,"immediately in case of suspicion",null,null,null,{"$f":"Basic_Data!F10","v":"00:00:00"}]
["Direct contacts"]
[{"$f":"IF(ISBLANK(Contacts!F4),\"\",Contacts!F4)","v":""},{"$f":"Contacts!$V$4","v":"1900-01-01"},{"$f":"Contacts!$W$4","v":"1900-01-15"},null,null,null,{"$f":"IF(Contacts!$AO$4>=0.1,$N$3,DATEVALUE(\"01.01.1900\"))","v":"1900-01-01"},{"$f":"IF(G5>DATEVALUE(\"01.01.1900\"),C5,DATEVALUE(\"01.01.1900\"))","v":"1900-01-01"},{"$f":"IF(G5>DATEVALUE(\"01.01.2000\"),\"yes\",\"\")","v":""},{"$f":"IF(B5>DATEVALUE(\"01.01.2000\"),$N$3,DATEVALUE(\"01.01.1900\"))","v":"1900-01-01"},{"$f":"IF(AND(Contacts!$AO$4>=0.05,Contacts!$AO$4<0.1),$N$3,DATEVALUE(\"01.01.1900\"))","v":"1900-01-01"},{"$f":"IF(K5>DATEVALUE(\"01.01.1900\"),C5,DATEVALUE(\"01.01.1900\"))","v":"1900-01-01"}]
[{"$f":"IF(ISBLANK(Contacts!F6),\"\",Contacts!F6)","v":""},{"$f":"Contacts!$V$6","v":"1900-01-01"},{"$f":"Contacts!$W$6","v":"1900-01-15"},null,null,null,{"$f":"IF(Contacts!$AO$6>=0.1,$N$3,DATEVALUE(\"01.01.1900\"))","v":"1900-01-01"},{"$f":"IF(G6>DATEVALUE(\"01.01.1900\"),C6,DATEVALUE(\"01.01.1900\"))","v":"1900-01-01"},"","1900-01-01",{"$f":"IF(AND(Contacts!$AO$6>=0.05,Contacts!$AO$6<0.1),$N$3,DATEVALUE(\"01.01.1900\"))","v":"1900-01-01"},"1900-01-01"]
[{"$f":"IF(ISBLANK(Contacts!F8),\"\",Contacts!F8)","v":""},{"$f":"Contacts!$V$8","v":"1900-01-01"},{"$f":"Contacts!$W$8","v":"1900-01-15"},null,null,null,{"$f":"IF(Contacts!$AO$8>=0.1,$N$3,DATEVALUE(\"01.01.1900\"))","v":"1900-01-01"},"1900-01-01","","1900-01-01",{"$f":"IF(AND(Contacts!$AO$8>=0.05,Contacts!$AO$8<0.1),$N$3,DATEVALUE(\"01.01.1900\"))","v":"1900-01-01"},"1900-01-01"]
[{"$f":"IF(ISBLANK(Contacts!F10),\"\",Contacts!F10)","v":""},{"$f":"Contacts!$V$10","v":"1900-01-01"},{"$f":"Contacts!$W$10","v":"1900-01-15"},null,null,null,{"$f":"IF(Contacts!$AO$10>=0.1,$N$3,DATEVALUE(\"01.01.1900\"))","v":"1900-01-01"},"1900-01-01","","1900-01-01",{"$f":"IF(AND(Contacts!$AO$10>=0.05,Contacts!$AO$10<0.1),$N$3,DATEVALUE(\"01.01.1900\"))","v":"1900-01-01"},"1900-01-01"]
{"$rows_left_out":18}
{"sheet":"Help","index":4,"n_rows":29,"n_cols":17,"rows_kept":29,"cut":false,"hidden":false,"merged":[[0,0,0,3],[0,5,0,8]]}
["Operating instructions",null,null,null,null,"Background"]
[]
[null,"Basic Data:","for the calculation of the infection-critical days, the specification of at least one date for the onset of symptoms,",null,null,"Basic assumptions:"]
[null,null,"execution or notification of the test or a suspected infection appointment is required.",null,null,"The duration of the incubation period in most cases is a maximum of 14 days."]
[null,null,"The indication of the onset of symptoms allows the most accurate calculation, following the indication",null,null,"The mean/median for the incubation period is 5 – 6 days."]
[null,null,"of a suspected infection date, if this can be limited to exactly one appointment.",null,null,"The duration of the infectious period is about 12 days. "]
[null,null,"After entering, the command key \"Check data\" must be pressed. The specification of the day of action is preset",null,null,"Infectivity is assumed 2 days before the onset of symptoms and no earlier than 3 days"]
[null,null,"to today's date and can be changed. ",null,null,"after critical contact."]
{"$rows_left_out":22}
{"sheet":"Settings","index":5,"n_rows":17,"n_cols":9,"rows_kept":17,"cut":false,"hidden":true,"merged":[]}
[null,"Expert-Settings"]
[]
[null,"Basic parameters for calculation based on empirical values can be changed by experts."]
[null,"By changing values, the calculations and their results are fundamentally changed!"]
[]
[null,null,null,null,null,null,null,null,"Standard Values"]
[null,"Basic Reproduction number wild type:",null,null,null,null,2.5,null,2.5]
[]
{"$rows_left_out":9}